Target
Glucose-dependent insulinotropic receptor
Ligand
BDBM180574
Substrate
Meas. Tech.
AlphaScreen cAMP Assay
pH
7.4±n/a
Temperature
310.15±n/a K
EC50
194±n/a nM
Comments
extracted
Citation
 Grauert, MBakker, RBreitfelder, SBuettner, FEickelmann, PFox, TGrundl, MLehmann-Lintz, TRist, W Benzoxazole- and tetrahydrobenzoxazole-substituted pyridazinones as GPR119 agonists US Patent  US8772323 Publication Date 7/8/2014 
Target
Name:
Glucose-dependent insulinotropic receptor
Synonyms:
G-protein coupled receptor 119 (GPR119) GPR119 | Glucose-dependent insulinotropic receptor
Type:
Protein
Mol. Mass.:
36901.49
Organism:
Homo sapiens (Human)
Description:
Q8TDV5
Residue:
335
  
Inhibitor
Name:
BDBM180574
Synonyms:
US8772323, 101
Type:
Small organic molecule
Emp. Form.:
C18H17N3O2S
Mol. Mass.:
339.411
SMILES:
CCC1CC(=O)NN=C1c1ccc2nc(oc2c1)-c1ccc(C)s1
: