Target
Aurora kinase A
Ligand
BDBM180867
Substrate
Meas. Tech.
Inhibition Assay
pH
7.5±n/a
Temperature
298.15±n/a K
IC50
271±n/a nM
Comments
extracted
Citation
 Reader, JC Aurora and FLT3 kinases modulators US Patent  US9133180 Publication Date 9/15/2015 
Target
Name:
Aurora kinase A
Synonyms:
AIK ARK-1 AURA AURKA_HUMAN Aurora 2 Aurora kinase A (AURKA) Aurora kinase A (Aurora-2) Aurora/IPL1-related kinase 1 Breast tumor-amplified kinase IAK1 STK15 GN Serine/threonine kinase 15 Serine/threonine-protein kinase 6 Serine/threonine-protein kinase aurora-A aurora-2 | hARK1
Type:
Serine/threonine-protein kinase
Mol. Mass.:
45830.98
Organism:
Homo sapiens (Human)
Description:
O14965
Residue:
403
  
Inhibitor
Name:
BDBM180867
Synonyms:
US9133180, 8
Type:
Small organic molecule
Emp. Form.:
C25H27N5O2
Mol. Mass.:
429.5142
SMILES:
Cc1c[nH]c2cccc(-c3nc(C(N)=O)c(o3)-c3ccc(cc3)N3CCNC(C)(C)C3)c12
: