Target
Alpha-glucosidase MAL12
Ligand
BDBM181058
Substrate
Meas. Tech.
In vitro Assay of alpha-Glucosidasee Inhibitory Activity
pH
6.8±n/a
IC50
8.169e+4± 3.9e+2 nM
Comments
extracted
Citation
 Wang, GHe, DLi, XLi, JPeng, Z Design, synthesis and biological evaluation of novel coumarin thiazole derivatives as a-glucosidase inhibitors. Bioorg Chem 65:167-74 (2016)  
Target
Name:
Alpha-glucosidase MAL12
Synonyms:
α-Glucosidase MAL12_YEAST Maltase | alpha-Glucosidase (α-Glucosidase)
Type:
Protein
Mol. Mass.:
68084.32
Organism:
Saccharomyces cerevisiae
Description:
P53341
Residue:
584
  
Inhibitor
Name:
BDBM181058
Synonyms:
(E)-N'-(4-Methoxybenzylidene)-4-(2-oxo-2H-chromen-3-yl)thiazole-2-carbohydrazide (7a)
Type:
Small organic molecule
Emp. Form.:
C21H15N3O4S
Mol. Mass.:
405.427
SMILES:
COc1ccc(\C=N\NC(=O)c2nc(cs2)-c2cc3ccccc3oc2=O)cc1
: