Target
Alpha-glucosidase MAL12
Ligand
BDBM181063
Substrate
Meas. Tech.
In vitro Assay of alpha-Glucosidasee Inhibitory Activity
pH
6.8±n/a
IC50
1.661e+4± 2.3e+2 nM
Comments
extracted
Citation
 Wang, GHe, DLi, XLi, JPeng, Z Design, synthesis and biological evaluation of novel coumarin thiazole derivatives as a-glucosidase inhibitors. Bioorg Chem 65:167-74 (2016)  
Target
Name:
Alpha-glucosidase MAL12
Synonyms:
α-Glucosidase MAL12_YEAST Maltase | alpha-Glucosidase (α-Glucosidase)
Type:
Protein
Mol. Mass.:
68084.32
Organism:
Saccharomyces cerevisiae
Description:
P53341
Residue:
584
  
Inhibitor
Name:
BDBM181063
Synonyms:
(E)-N'-(3-Fluoro-4-hydroxybenzylidene)-4-(2-oxo-2Hchromen-3-yl)thiazole-2-carbohydrazide (7g)
Type:
Small organic molecule
Emp. Form.:
C20H12FN3O4S
Mol. Mass.:
409.39
SMILES:
Oc1ccc(\C=N\NC(=O)c2nc(cs2)-c2cc3ccccc3oc2=O)cc1F
: