Target
Alpha-glucosidase MAL12
Ligand
BDBM181069
Substrate
Meas. Tech.
In vitro Assay of alpha-Glucosidasee Inhibitory Activity
pH
6.8±n/a
IC50
1.195e+4± 1.4e+2 nM
Comments
extracted
Citation
 Wang, GHe, DLi, XLi, JPeng, Z Design, synthesis and biological evaluation of novel coumarin thiazole derivatives as a-glucosidase inhibitors. Bioorg Chem 65:167-74 (2016)  
Target
Name:
Alpha-glucosidase MAL12
Synonyms:
α-Glucosidase MAL12_YEAST Maltase | alpha-Glucosidase (α-Glucosidase)
Type:
Protein
Mol. Mass.:
68084.32
Organism:
Saccharomyces cerevisiae
Description:
P53341
Residue:
584
  
Inhibitor
Name:
BDBM181069
Synonyms:
(E)-N'-(3-Chlorobenzylidene)-4-(2-oxo-2H-chromen-3-yl)thiazole-2-carbohydrazide (7n)
Type:
Small organic molecule
Emp. Form.:
C20H12ClN3O3S
Mol. Mass.:
409.846
SMILES:
Clc1cccc(\C=N\NC(=O)c2nc(cs2)-c2cc3ccccc3oc2=O)c1
: