Target
Alpha-glucosidase MAL12
Ligand
BDBM181074
Substrate
Meas. Tech.
In vitro Assay of alpha-Glucosidasee Inhibitory Activity
pH
6.8±n/a
IC50
6.427e+4± 2.2e+2 nM
Comments
extracted
Citation
 Wang, GHe, DLi, XLi, JPeng, Z Design, synthesis and biological evaluation of novel coumarin thiazole derivatives as a-glucosidase inhibitors. Bioorg Chem 65:167-74 (2016)  
Target
Name:
Alpha-glucosidase MAL12
Synonyms:
α-Glucosidase MAL12_YEAST Maltase | alpha-Glucosidase (α-Glucosidase)
Type:
Protein
Mol. Mass.:
68084.32
Organism:
Saccharomyces cerevisiae
Description:
P53341
Residue:
584
  
Inhibitor
Name:
BDBM181074
Synonyms:
(E)-N'-(2-Methoxybenzylidene)-4-(2-oxo-2H-chromen-3-yl)thiazole-2-carbohydrazide (7s)
Type:
Small organic molecule
Emp. Form.:
C21H15N3O4S
Mol. Mass.:
405.427
SMILES:
COc1ccccc1\C=N\NC(=O)c1nc(cs1)-c1cc2ccccc2oc1=O
: