Target
P2X purinoceptor 3
Ligand
BDBM183277
Substrate
Meas. Tech.
Inhibition Assay
pH
7.5±n/a
Temperature
310.15±n/a K
IC50
8±n/a nM
Comments
extracted
Citation
 Kai, HKameyama, THasegawa, TOohara, MTada, YEndoh, T Triazine derivative and pharmaceutical composition comprising the same US Patent  US9150546 Publication Date 10/6/2015 
Target
Name:
P2X purinoceptor 3
Synonyms:
ATP receptor P2RX3 P2X purinoceptor 3 P2X purinoceptor 3 (P2X3) P2X3 purinoceptor p2x3 + hsa
Type:
Protein
Mol. Mass.:
44292.02
Organism:
Homo sapiens (Human)
Description:
P56373
Residue:
397
  
Inhibitor
Name:
BDBM183277
Synonyms:
US9150546, I-445 US9718790, I-0454
Type:
Small organic molecule
Emp. Form.:
C27H24ClFN4O5
Mol. Mass.:
538.955
SMILES:
CC(C)Oc1ccc(cc1F)\N=c1/[nH]c(=O)n(Cc2ccc(cc2)C(O)=O)c(=O)n1Cc1ccc(Cl)cc1
: