Target
Insulin receptor [964-1370]
Ligand
BDBM184370
Substrate
Meas. Tech.
DELFIA Assay
pH
7.4±n/a
IC50
0.23±n/a nM
Comments
extracted
Citation
 Treu, M 5,8-dihydro-6H-pyrazolo[3,4-h]quinazolines as IGF-1R/IR inhibitors US Patent  US9150578 Publication Date 10/6/2015 
Target
Name:
Insulin receptor [964-1370]
Synonyms:
INSR Insulin-like growth factor 1 receptor (aa 964-1370)
Type:
Mol. Mass.:
46101.87
Organism:
Homo sapiens (Human)
Description:
P06213[964-1370]
Residue:
407
  
Inhibitor
Name:
BDBM184370
Synonyms:
US9150578, I-018
Type:
Small organic molecule
Emp. Form.:
C25H25N9
Mol. Mass.:
451.5263
SMILES:
Cn1cc(Nc2ncc3CCc4nn(C)c(Cc5cccc(c5)-c5cnn(C)c5)c4-c3n2)cn1
: