Target
Prostaglandin E2 receptor EP1 subtype
Ligand
BDBM184625
Substrate
Meas. Tech.
Radioligand Binding
pH
7.4±n/a
Temperature
277.15±n/a K
IC50
782±n/a nM
Comments
extracted
Citation
 Donde, YNguyen, JHKedzie, KMGil, DWDonello, JEIm, W Treatment of inflammatory bowel disease US Patent  US9156810 Publication Date 10/13/2015 
Target
Name:
Prostaglandin E2 receptor EP1 subtype
Synonyms:
PE2R1_HUMAN PTGER1 Prostaglandin E2 receptor EP1 subtype Prostanoid EP1 receptor
Type:
Enzyme
Mol. Mass.:
41834.57
Organism:
Homo sapiens (Human)
Description:
P34995
Residue:
402
  
Inhibitor
Name:
BDBM184625
Synonyms:
US9156810, 44
Type:
Small organic molecule
Emp. Form.:
C22H36O5
Mol. Mass.:
380.5182
SMILES:
CCCCC[C@H](O)\C=C\[C@H]1[C@H](O)C(C)(C)C(=O)[C@@H]1C\C=C/CCCC(O)=O
: