Target
Prostaglandin E2 receptor EP1 subtype
Ligand
BDBM184633
Substrate
Meas. Tech.
Radioligand Binding
pH
7.4±n/a
Temperature
277.15±n/a K
IC50
>10000±n/a nM
Comments
extracted
Citation
 Donde, YNguyen, JHKedzie, KMGil, DWDonello, JEIm, W Treatment of inflammatory bowel disease US Patent  US9156810 Publication Date 10/13/2015 
Target
Name:
Prostaglandin E2 receptor EP1 subtype
Synonyms:
PE2R1_HUMAN PTGER1 Prostaglandin E2 receptor EP1 subtype Prostanoid EP1 receptor
Type:
Enzyme
Mol. Mass.:
41834.57
Organism:
Homo sapiens (Human)
Description:
P34995
Residue:
402
  
Inhibitor
Name:
BDBM184633
Synonyms:
US9156810, (62, 63)
Type:
Small organic molecule
Emp. Form.:
C30H41NO4S
Mol. Mass.:
511.716
SMILES:
CCN(CC)C(=O)CCC\C=C/C[C@@H]1[C@@H](\C=C\C(O)Cc2cc3ccccc3s2)[C@H](O)C(C)(C)C1=O
: