Target
Prostaglandin E2 receptor EP1 subtype
Ligand
BDBM184631
Substrate
Meas. Tech.
Radioligand Binding
pH
7.4±n/a
Temperature
277.15±n/a K
IC50
308±n/a nM
Comments
extracted
Citation
 Donde, YNguyen, JHKedzie, KMGil, DWDonello, JEIm, W Treatment of inflammatory bowel disease US Patent  US9156810 Publication Date 10/13/2015 
Target
Name:
Prostaglandin E2 receptor EP1 subtype
Synonyms:
PE2R1_HUMAN PTGER1 Prostaglandin E2 receptor EP1 subtype Prostanoid EP1 receptor
Type:
Enzyme
Mol. Mass.:
41834.57
Organism:
Homo sapiens (Human)
Description:
P34995
Residue:
402
  
Inhibitor
Name:
BDBM184631
Synonyms:
US9156810, (54, 55)
Type:
Small organic molecule
Emp. Form.:
C26H32O5S
Mol. Mass.:
456.594
SMILES:
CC1(C)[C@@H](O)[C@H](\C=C\C(O)Cc2cc3ccccc3s2)[C@@H](C\C=C/CCCC(O)=O)C1=O
: