Target
Glycylpeptide N-tetradecanoyltransferase 1
Ligand
BDBM185015
Substrate
Meas. Tech.
Enzyme Inhibition Assay
pH
7.4±n/a
Temperature
298.15±n/a K
IC50
141±n/a nM
Comments
extracted
Citation
 Brand, SWyatt, PThompson, SSmith, VBayliss, THarrison, JNorcross, NCleghorn, LGilbert, IBrenk, R N-myristoyl transferase inhibitors US Patent  US9156811 Publication Date 10/13/2015 
Target
Name:
Glycylpeptide N-tetradecanoyltransferase 1
Synonyms:
Myristoyl-CoA:protein N-myristoyltransferase (Nmt) NMT NMT1_HUMAN Peptide N-myristoyltransferase 1
Type:
Enzyme
Mol. Mass.:
56814.10
Organism:
Homo sapiens (Human)
Description:
P30419
Residue:
496
  
Inhibitor
Name:
BDBM185015
Synonyms:
US9156811, DDD99751
Type:
Small organic molecule
Emp. Form.:
C22H33Cl2N5O2S
Mol. Mass.:
502.501
SMILES:
CC1CN(CCCc2cc(Cl)c(c(Cl)c2)[S+]([O-])(=O)N(C)c2c(C)nn(C)c2C)CC(C)N1
: