Target
Glycylpeptide N-tetradecanoyltransferase
Ligand
BDBM185100
Substrate
Meas. Tech.
Enzyme Inhibition Assay
pH
7.4±n/a
Temperature
298.15±n/a K
IC50
224±n/a nM
Comments
extracted
Citation
 Brand, SWyatt, PThompson, SSmith, VBayliss, THarrison, JNorcross, NCleghorn, LGilbert, IBrenk, R N-myristoyl transferase inhibitors US Patent  US9156811 Publication Date 10/13/2015 
Target
Name:
Glycylpeptide N-tetradecanoyltransferase
Synonyms:
Glycylpeptide N-tetradecanoyltransferase | N-myristoyltransferase (NMT1)
Type:
Protein
Mol. Mass.:
48514.36
Organism:
Leishmania major
Description:
Q4Q5S8
Residue:
421
  
Inhibitor
Name:
BDBM185100
Synonyms:
US9156811, DDD100806
Type:
Small organic molecule
Emp. Form.:
C26H33FN4O2S
Mol. Mass.:
484.629
SMILES:
CC(C)Cc1nn(C)c(C)c1N[S+]([O-])(=O)c1ccc(cc1)-c1ccc(F)c(CN2CCCC2)c1
: