Target
Leucine-rich repeat serine/threonine-protein kinase 2 [G2019S]
Ligand
BDBM50059290
Substrate
Meas. Tech.
Lantha Screen Technology Assay
pH
7.5±n/a
IC50
176±n/a nM
Comments
extracted
Citation
 Galatsis, PHayward, MMKormos, BLWager, TTZhang, LStepan, AFHenderson, JLKurumbail, RGVerhoest, PR 4-(substituted amino)-7H-pyrrolo[2,3-d] pyrimidines as LRRK2 inhibitors US Patent  US9156845 Publication Date 10/13/2015 
Target
Name:
Leucine-rich repeat serine/threonine-protein kinase 2 [G2019S]
Synonyms:
LRRK2 LRRK2_HUMAN Leucine-rich repeat serine/threonine-protein kinase 2 (LRRK2)(G2019S) PARK8
Type:
Mol. Mass.:
286143.23
Organism:
Homo sapiens (Human)
Description:
Q5S007(G2019S)
Residue:
2527
  
Inhibitor
Name:
BDBM50059290
Synonyms:
CHEMBL3393448 | US9156845, 110
Type:
Small organic molecule
Emp. Form.:
C20H17N7O2
Mol. Mass.:
387.3947
SMILES:
Cc1noc(n1)C1CN(CCO1)c1ncnc2[nH]cc(-c3cccc(c3)C#N)c12
: