Target
Sodium channel protein type 9 subunit alpha
Ligand
BDBM60788
Substrate
Meas. Tech.
FLIPR Assay
pH
7.3±n/a
IC50
418±58 nM
Comments
extracted
Citation
 Goehring, RRTafesse, LYao, J Quinazoline compounds as sodium channel blockers US Patent  US9168255 Publication Date 10/27/2015 
Target
Name:
Sodium channel protein type 9 subunit alpha
Synonyms:
NENA Peripheral sodium channel 1 SCN9A_HUMAN Voltage-gated sodium channel subunit Nav1.7 hNE-Na
Type:
Protein
Mol. Mass.:
226375.97
Organism:
Homo sapiens (Human)
Description:
Q15858
Residue:
1988
  
Inhibitor
Name:
BDBM60788
Synonyms:
US9168255, 13k
Type:
Emp. Form.:
C25H23FN4O
Mol. Mass.:
414.4747
SMILES:
CN1CCN(CC1)c1nc(-c2ccc(Oc3ccc(F)cc3)cc2)c2ccccc2n1
: