Target
11-beta-hydroxysteroid dehydrogenase 1
Ligand
BDBM186145
Substrate
Meas. Tech.
Scintillation Proximity Assay
Temperature
298.15±n/a K
IC50
3.07±n/a nM
Comments
extracted
Citation
 Claremon, DATice, CMZhuang, LLeftheris, KYe, YSingh, SB Carbamate and urea inhibitors of 11β-hydroxysteroid dehydrogenase 1 US Patent  US9163012 Publication Date 10/20/2015 
Target
Name:
11-beta-hydroxysteroid dehydrogenase 1
Synonyms:
11-DH 11-beta-Hydroxysteroid Dehydrogenase 1 (11-beta-HSD1) 11-beta-hydroxysteroid dehydrogenase 1 (11HSD1) Corticosteroid 11-beta-dehydrogenase isozyme 1 (11-beta-HSD-1) Corticosteroid 11-beta-dehydrogenase isozyme 1 (11beta-HSD1) HSD11 HSD11L | SDR26C1
Type:
Enzyme
Mol. Mass.:
32409.16
Organism:
Homo sapiens (Human)
Description:
P28845
Residue:
292
  
Inhibitor
Name:
BDBM186145
Synonyms:
US9163012, 62
Type:
Small organic molecule
Emp. Form.:
C24H30N4O4
Mol. Mass.:
438.5194
SMILES:
Cn1c2ccccc2n([C@@H]2CCN(C2)C(=O)O[C@H]2C3CC4CC2C[C@](C4)(C3)C(N)=O)c1=O
: