Target
11-beta-hydroxysteroid dehydrogenase 1
Ligand
BDBM186151
Substrate
Meas. Tech.
Scintillation Proximity Assay
Temperature
298.15±n/a K
IC50
0.46±n/a nM
Comments
extracted
Citation
 Claremon, DATice, CMZhuang, LLeftheris, KYe, YSingh, SB Carbamate and urea inhibitors of 11β-hydroxysteroid dehydrogenase 1 US Patent  US9163012 Publication Date 10/20/2015 
Target
Name:
11-beta-hydroxysteroid dehydrogenase 1
Synonyms:
11-DH 11-beta-Hydroxysteroid Dehydrogenase 1 (11-beta-HSD1) 11-beta-hydroxysteroid dehydrogenase 1 (11HSD1) Corticosteroid 11-beta-dehydrogenase isozyme 1 (11-beta-HSD-1) Corticosteroid 11-beta-dehydrogenase isozyme 1 (11beta-HSD1) HSD11 HSD11L | SDR26C1
Type:
Enzyme
Mol. Mass.:
32409.16
Organism:
Homo sapiens (Human)
Description:
P28845
Residue:
292
  
Inhibitor
Name:
BDBM186151
Synonyms:
US9163012, 68
Type:
Small organic molecule
Emp. Form.:
C23H27ClN4O4
Mol. Mass.:
458.938
SMILES:
NC(=O)[C@@]12CC3CC(C1)[C@H](OC(=O)N1CC[C@H](C1)n1c4c(Cl)cccc4[nH]c1=O)C(C3)C2
: