Target
Glycogen synthase kinase-3 beta
Ligand
BDBM186195
Substrate
Meas. Tech.
LanthaScreen TR-FRET Assay
Temperature
295.15±n/a K
IC50
10±n/a nM
Comments
extracted
Citation
 Alisi, MACazzolla, NGarofalo, BFurlotti, GMagaro′, GOmbrato, RMancini, F Use of 1H-indazole-3-carboxamide compounds as glycogen synthase kinase 3 beta inhibitors US Patent  US9163013 Publication Date 10/20/2015 
Target
Name:
Glycogen synthase kinase-3 beta
Synonyms:
GSK-3 beta GSK3B Glycogen synthase kinase 3 beta (GSK3B) Glycogen synthase kinase-3 beta (GSK-3B) Glycogen synthase kinase-3 beta (GSK3B) Glycogen synthase kinase-3beta (GSK3B) | Serine/threonine-protein kinase GSK3B
Type:
Enzyme
Mol. Mass.:
46756.38
Organism:
Homo sapiens (Human)
Description:
P49841
Residue:
420
  
Inhibitor
Name:
BDBM186195
Synonyms:
US9163013, 12
Type:
Small organic molecule
Emp. Form.:
C25H23F2N5O4
Mol. Mass.:
495.478
SMILES:
OC(=O)c1coc(CN2CCC(CNC(=O)c3n[nH]c4ccc(cc34)-c3cccc(F)c3F)CC2)n1
: