Target
Glycogen synthase kinase-3 beta
Ligand
BDBM186197
Substrate
Meas. Tech.
LanthaScreen TR-FRET Assay
Temperature
295.15±n/a K
IC50
230±n/a nM
Comments
extracted
Citation
 Alisi, MACazzolla, NGarofalo, BFurlotti, GMagaro′, GOmbrato, RMancini, F Use of 1H-indazole-3-carboxamide compounds as glycogen synthase kinase 3 beta inhibitors US Patent  US9163013 Publication Date 10/20/2015 
Target
Name:
Glycogen synthase kinase-3 beta
Synonyms:
GSK-3 beta GSK3B Glycogen synthase kinase 3 beta (GSK3B) Glycogen synthase kinase-3 beta (GSK-3B) Glycogen synthase kinase-3 beta (GSK3B) Glycogen synthase kinase-3beta (GSK3B) | Serine/threonine-protein kinase GSK3B
Type:
Enzyme
Mol. Mass.:
46756.38
Organism:
Homo sapiens (Human)
Description:
P49841
Residue:
420
  
Inhibitor
Name:
BDBM186197
Synonyms:
US9163013, 14
Type:
Small organic molecule
Emp. Form.:
C22H26N4O5
Mol. Mass.:
426.4656
SMILES:
COC(=O)c1ccoc1CN1CCC(CNC(=O)c2n[nH]c3ccc(OC)cc23)CC1
: