Target
High affinity nerve growth factor receptor
Ligand
BDBM186344
Substrate
Meas. Tech.
HTRF Assay
IC50
6.32±n/a nM
Citation
 Andrews, MDBagal, SKBrown, DGGibson, KRKlute, WMorao, IOmoto, KRyckmans, TSabnis, YSkerratt, SEStupple, PA Pyrrolo[3,2-c]pyridine tropomyosin-related kinase inhibitors US Patent  US9163021 Publication Date 10/20/2015 
Target
Name:
High affinity nerve growth factor receptor
Synonyms:
2.7.10.1 NTRK1 NTRK1_HUMAN Neurotrophic tyrosine kinase receptor type 1 Synonyms=MTC TRK1-transforming tyrosine kinase protein TRKA GN Trk-A Tropomyosin-related kinase A Tyrosine kinase receptor Tyrosine kinase receptor A Tyrosine kinase receptor A (Trk-A) gp140trk | p140-TrkA
Type:
Mol. Mass.:
87498.18
Organism:
Homo sapiens (Human)
Description:
P04629
Residue:
796
  
Inhibitor
Name:
BDBM186344
Synonyms:
US9163021, 1
Type:
Small organic molecule
Emp. Form.:
C24H22F4N6O3
Mol. Mass.:
518.4635
SMILES:
Cc1cc(nn1CC(=O)Nc1cncc(c1)C(=O)c1cn(c2c(F)cncc12)C(C)(C)CO)C(F)(F)F
: