Target
High affinity nerve growth factor receptor
Ligand
BDBM186345
Substrate
Meas. Tech.
HTRF Assay
IC50
5.58±n/a nM
Citation
 Andrews, MDBagal, SKBrown, DGGibson, KRKlute, WMorao, IOmoto, KRyckmans, TSabnis, YSkerratt, SEStupple, PA Pyrrolo[3,2-c]pyridine tropomyosin-related kinase inhibitors US Patent  US9163021 Publication Date 10/20/2015 
Target
Name:
High affinity nerve growth factor receptor
Synonyms:
2.7.10.1 NTRK1 NTRK1_HUMAN Neurotrophic tyrosine kinase receptor type 1 Synonyms=MTC TRK1-transforming tyrosine kinase protein TRKA GN Trk-A Tropomyosin-related kinase A Tyrosine kinase receptor Tyrosine kinase receptor A Tyrosine kinase receptor A (Trk-A) gp140trk | p140-TrkA
Type:
Mol. Mass.:
87498.18
Organism:
Homo sapiens (Human)
Description:
P04629
Residue:
796
  
Inhibitor
Name:
BDBM186345
Synonyms:
US9163021, 2
Type:
Small organic molecule
Emp. Form.:
C25H25FN6O3
Mol. Mass.:
476.5028
SMILES:
CC(C)(CO)n1cc(C(=O)c2cncc(NC(=O)Cn3ccc(n3)C3CC3)c2)c2cncc(F)c12
: