Target
High affinity nerve growth factor receptor
Ligand
BDBM186373
Substrate
Meas. Tech.
HTRF Assay
IC50
13.3±n/a nM
Citation
 Andrews, MDBagal, SKBrown, DGGibson, KRKlute, WMorao, IOmoto, KRyckmans, TSabnis, YSkerratt, SEStupple, PA Pyrrolo[3,2-c]pyridine tropomyosin-related kinase inhibitors US Patent  US9163021 Publication Date 10/20/2015 
Target
Name:
High affinity nerve growth factor receptor
Synonyms:
2.7.10.1 NTRK1 NTRK1_HUMAN Neurotrophic tyrosine kinase receptor type 1 Synonyms=MTC TRK1-transforming tyrosine kinase protein TRKA GN Trk-A Tropomyosin-related kinase A Tyrosine kinase receptor Tyrosine kinase receptor A Tyrosine kinase receptor A (Trk-A) gp140trk | p140-TrkA
Type:
Mol. Mass.:
87498.18
Organism:
Homo sapiens (Human)
Description:
P04629
Residue:
796
  
Inhibitor
Name:
BDBM186373
Synonyms:
US9163021, 30
Type:
Small organic molecule
Emp. Form.:
C22H19F3N6O2
Mol. Mass.:
456.4205
SMILES:
CC(C)n1cc(C(=O)c2cc(NC(=O)Cn3cc(cn3)C(F)(F)F)ccn2)c2cnccc12
: