Target
High affinity nerve growth factor receptor
Ligand
BDBM186527
Substrate
Meas. Tech.
HTRF Assay
IC50
13.8±n/a nM
Citation
 Andrews, MDBagal, SKBrown, DGGibson, KRKlute, WMorao, IOmoto, KRyckmans, TSabnis, YSkerratt, SEStupple, PA Pyrrolo[3,2-c]pyridine tropomyosin-related kinase inhibitors US Patent  US9163021 Publication Date 10/20/2015 
Target
Name:
High affinity nerve growth factor receptor
Synonyms:
2.7.10.1 NTRK1 NTRK1_HUMAN Neurotrophic tyrosine kinase receptor type 1 Synonyms=MTC TRK1-transforming tyrosine kinase protein TRKA GN Trk-A Tropomyosin-related kinase A Tyrosine kinase receptor Tyrosine kinase receptor A Tyrosine kinase receptor A (Trk-A) gp140trk | p140-TrkA
Type:
Mol. Mass.:
87498.18
Organism:
Homo sapiens (Human)
Description:
P04629
Residue:
796
  
Inhibitor
Name:
BDBM186527
Synonyms:
US9163021, 194
Type:
Small organic molecule
Emp. Form.:
C25H19F3N4O4
Mol. Mass.:
496.438
SMILES:
FC(F)(F)Oc1cccc(CC(=O)Nc2cc(ccn2)C(=O)c2cn(C3COC3)c3ccncc23)c1
: