Target
Phosphatidylinositol 4-phosphate 3-kinase C2 domain-containing subunit beta
Ligand
BDBM288331
Substrate
Meas. Tech.
KINOMEscan Enzyme Binding Assays
Kd
9.00±n/a nM
Citation
 Mevellec, LAMeerpoel, LCoupa, SPoncelet, VSPilatte, INPasquier, ETBerthelot, DJQuerolle, OAMeyer, CAngibaud, PRDemestre, CGMercey, GJ Imidazopyridazine derivatives as PI3KB inhibitors US Patent  US10087187 Publication Date 10/2/2018 
Target
Name:
Phosphatidylinositol 4-phosphate 3-kinase C2 domain-containing subunit beta
Synonyms:
C2-PI3K PI3K-C2beta Phosphatidylinositol 4-phosphate 3-kinase C2 beta (PIK3C2B) Phosphoinositide 3-Kinase (PI3K), C2beta PtdIns-3-kinase C2 beta
Type:
Enzyme
Mol. Mass.:
184784.86
Organism:
Homo sapiens (Human)
Description:
O00750
Residue:
1634
  
Inhibitor
Name:
BDBM288331
Synonyms:
US10087187, Compound 21
Type:
Small organic molecule
Emp. Form.:
C23H23F3N6O2
Mol. Mass.:
472.4629
SMILES:
Cc1c(Cc2c(CO)nc3c(cc(nn23)N2CCOCC2)-c2ccn[nH]2)cccc1C(F)(F)F
: