Target
Acetyl-CoA carboxylase 2
Ligand
BDBM186634
Substrate
Meas. Tech.
Spectrophotometric 384 Well Assay
pH
7.5±n/a
IC50
913±n/a nM
Comments
extracted
Citation
 Fleck, MHeine, NNosse, BRoth, GJHeimann, A Pyrrolidine derivatives, pharmaceutical compositions and uses thereof US Patent  US9169205 Publication Date 10/27/2015 
Target
Name:
Acetyl-CoA carboxylase 2
Synonyms:
ACACB ACC-beta ACCB Acetyl-CoA carboxylase 2 Acetyl-CoA carboxylase 2 (ACC2)
Type:
Protein
Mol. Mass.:
276535.21
Organism:
Homo sapiens (Human)
Description:
O00763
Residue:
2458
  
Inhibitor
Name:
BDBM186634
Synonyms:
US9169205, 1.31
Type:
Small organic molecule
Emp. Form.:
C21H25FN2O2
Mol. Mass.:
356.4338
SMILES:
C[C@H](NC(C)=O)c1ccc(OC2CCN(C2)c2cccc(F)c2C)cc1
: