Target
Dihydrolipoyl dehydrogenase
Ligand
BDBM188293
Substrate
Meas. Tech.
Inhibition Assay
pH
7±n/a
IC50
<40±n/a nM
Comments
extracted
Citation
 Wong, CWu, Y Compounds and methods for treating tuberculosis infection US Patent  US9073941 Publication Date 7/7/2015 
Target
Name:
Dihydrolipoyl dehydrogenase
Synonyms:
DLDH_MYCTU lpd | lpdC
Type:
Enzyme
Mol. Mass.:
49231.98
Organism:
Mycobacterium tuberculosis
Description:
P9WHH9
Residue:
464
  
Inhibitor
Name:
BDBM188293
Synonyms:
US9073941, 621
Type:
Small organic molecule
Emp. Form.:
C16H15N5O4
Mol. Mass.:
341.3214
SMILES:
CCn1nc(nc2c1nc(=O)n(C)c2=O)-c1ccc(cc1)C(=O)OC
: