Target
Dihydrolipoyllysine-residue acetyltransferase component of pyruvate dehydrogenase complex
Ligand
BDBM188304
Substrate
Meas. Tech.
Inhibition Assay
pH
7±n/a
IC50
<40±n/a nM
Comments
extracted
Citation
 Wong, CWu, Y Compounds and methods for treating tuberculosis infection US Patent  US9073941 Publication Date 7/7/2015 
Target
Name:
Dihydrolipoyllysine-residue acetyltransferase component of pyruvate dehydrogenase complex
Synonyms:
ODP2_MYCTU dlaT | sucB
Type:
Enzyme
Mol. Mass.:
57069.35
Organism:
Mycobacterium tuberculosis
Description:
P9WIS7
Residue:
553
  
Inhibitor
Name:
BDBM188304
Synonyms:
US9073941, 905
Type:
Small organic molecule
Emp. Form.:
C16H9N3O2
Mol. Mass.:
275.2616
SMILES:
O=C1c2nn(nc2-c2ccccc2C1=O)-c1ccccc1
: