Target
Interleukin-1 receptor-associated kinase 4
Ligand
BDBM187695
Substrate
Meas. Tech.
Inhibition Assay
pH
7.2±n/a
IC50
19.8±n/a nM
Citation
 Santella, JBKumar, SRDuncia, JVGardner, DSPaidi, VRNair, SKHynes, JWu, HMurugesan, NSarkunam, KArunachalam, P Heteroaryl substituted nicotinamide compounds US Patent  US9169252 Publication Date 10/27/2015 
Target
Name:
Interleukin-1 receptor-associated kinase 4
Synonyms:
IRAK-4 IRAK4_HUMAN Interleukin-1 receptor-associated kinase 4 (IRAK4) | Renal carcinoma antigen NY-REN-64
Type:
Protein
Mol. Mass.:
51519.08
Organism:
Homo sapiens (Human)
Description:
Q9NWZ3
Residue:
460
  
Inhibitor
Name:
BDBM187695
Synonyms:
US9169252, 246
Type:
Small organic molecule
Emp. Form.:
C22H26N8O3S
Mol. Mass.:
482.559
SMILES:
CC(C)Nc1cc(ncc1C(=O)N[C@H]1CCCN(C1)S(C)(=O)=O)-n1ncc2cc(cnc12)C#N
: