Target
G-protein coupled estrogen receptor 1
Ligand
BDBM288654
Substrate
Meas. Tech.
Biological Assay
IC50
34.0±n/a nM
Citation
 Yu, SYang, FChen, LYan, JZhang, XXie, ZChen, LHe, M Piperidine derivative and preparation method and pharmaceutical use thereof US Patent  US10087191 Publication Date 10/2/2018 
Target
Name:
G-protein coupled estrogen receptor 1
Synonyms:
CEPR DRY12 G-protein-coupled receptor (GPR30 ) GPER1 GPR30
Type:
PROTEIN
Mol. Mass.:
42259.21
Organism:
Homo sapiens (Human)
Description:
ChEMBL_982507
Residue:
375
  
Inhibitor
Name:
BDBM288654
Synonyms:
US10087191, Example 69
Type:
Small organic molecule
Emp. Form.:
C25H24F3NO3
Mol. Mass.:
443.4582
SMILES:
C[C@H]1Cc2c(oc3ccccc23)[C@@H](N1CC(C)(C)F)c1c(F)cc(\C=C\C(O)=O)cc1F
: