Target
Sodium channel protein type 9 subunit alpha
Ligand
BDBM190557
Substrate
Meas. Tech.
FLIPR TETRA Sodium Dye Assay
Temperature
310.15±n/a K
IC50
282±2 nM
Comments
extracted
Citation
 Yao, J Heteroaryl compounds as sodium channel blockers US Patent  US9181185 Publication Date 11/10/2015 
Target
Name:
Sodium channel protein type 9 subunit alpha
Synonyms:
NENA Peripheral sodium channel 1 SCN9A_HUMAN Voltage-gated sodium channel subunit Nav1.7 hNE-Na
Type:
Protein
Mol. Mass.:
226375.97
Organism:
Homo sapiens (Human)
Description:
Q15858
Residue:
1988
  
Inhibitor
Name:
BDBM190557
Synonyms:
US9181185, 7 | US9624194, Compound 7
Type:
Small organic molecule
Emp. Form.:
C24H20F3N3O4
Mol. Mass.:
471.4285
SMILES:
CNC(=O)[C@@H](O)[C@H](O)c1cn(-c2ccc(Oc3ccc(cn3)C(F)(F)F)cc2)c2ccccc12
: