Target
Beta-secretase 2
Ligand
BDBM190731
Substrate
Meas. Tech.
HTRF FRET Assay
pH
5±n/a
Temperature
303.15±n/a K
Ki
<20±n/a nM
Comments
extracted
Citation
 Wu, WBurnett, DAStamford, AWCumming, JNAsberom, TBennett, CSasiskumar, TKScott, JD 2-spiro-substituted iminothiazines and their mono-and dioxides as bace inhibitors, compositions and their use US Patent  US9181236 Publication Date 11/10/2015 
Target
Name:
Beta-secretase 2
Synonyms:
AEPLC ASP1 Asp 1 Aspartyl protease 1 BACE2_HUMAN Beta-secretase (BACE) Beta-secretase 2 (BACE-2) Beta-site APP-cleaving enzyme 2 Memapsin-1 beta-Secretase (BACE-2)
Type:
Protein
Mol. Mass.:
56171.20
Organism:
Homo sapiens (Human)
Description:
Q9Y5Z0
Residue:
518
  
Inhibitor
Name:
BDBM190731
Synonyms:
US9181236, 35
Type:
Small organic molecule
Emp. Form.:
C22H25FN4O5S
Mol. Mass.:
476.521
SMILES:
COc1ccc(nc1)C(=O)Nc1ccc(F)c(c1)[C@]1(C)CS(=O)(=O)C2(CCOCC2)C(=N)N1
: