Target
G-protein coupled receptor 6
Ligand
BDBM191021
Substrate
Meas. Tech.
GPR6 In Vitro Assay (A.2)
IC50
0.0748±n/a nM
Citation
 Brown, JHitchcock, SHopkins, MKikuchi, SMonenschein, HReichard, HSchleicher, KSun, HMacklin, T Substituted pyrido[3,4-b]pyrazines as GPR6 modulators US Patent  US9181249 Publication Date 11/10/2015 
Target
Name:
G-protein coupled receptor 6
Synonyms:
G-protein coupled receptor 6 (GPR6) GPR6_HUMAN | Sphingosine 1-phosphate receptor GPR6
Type:
Protein
Mol. Mass.:
37886.39
Organism:
Homo sapiens (Human)
Description:
P46095
Residue:
362
  
Inhibitor
Name:
BDBM191021
Synonyms:
US10077266, Example 133 US9708313, 133
Type:
Small organic molecule
Emp. Form.:
C23H30F3N5O
Mol. Mass.:
449.5124
SMILES:
CC(C)Nc1nc2CN(CCF)CCc2nc1N1CCC(CC1)Oc1ccc(F)cc1F
: