Target
G-protein coupled receptor 6
Ligand
BDBM191042
Substrate
Meas. Tech.
GPR6 In Vitro Assay (A.2)
IC50
0.0978±n/a nM
Citation
 Brown, JHitchcock, SHopkins, MKikuchi, SMonenschein, HReichard, HSchleicher, KSun, HMacklin, T Substituted pyrido[3,4-b]pyrazines as GPR6 modulators US Patent  US9181249 Publication Date 11/10/2015 
Target
Name:
G-protein coupled receptor 6
Synonyms:
G-protein coupled receptor 6 (GPR6) GPR6_HUMAN | Sphingosine 1-phosphate receptor GPR6
Type:
Protein
Mol. Mass.:
37886.39
Organism:
Homo sapiens (Human)
Description:
P46095
Residue:
362
  
Inhibitor
Name:
BDBM191042
Synonyms:
US10077266, Example 154 US9708313, 154
Type:
Small organic molecule
Emp. Form.:
C24H30F2N6O2
Mol. Mass.:
472.5308
SMILES:
CC(=O)N1CCc2nc(N3CCN(Cc4ccc(F)cc4F)CC3)c(N[C@H]3CCOC3)nc2C1
: