Target
Phosphatidylinositol 3-kinase regulatory subunit beta
Ligand
BDBM288911
Substrate
Meas. Tech.
TR-FRET PIK3 Assay
pH
7.4±n/a
IC50
48000±n/a nM
Comments
extracted
Citation
 Cai, SDu, ZKaplan, JLoyer-Drew, JANaduthambi, DPhillips, BWPhillips, GVan Veldhuizen, JWatkins, WJYeung, SC Phosphatidylinositol 3-kinase inhibitors US Patent  US10092563 Publication Date 10/9/2018 
Target
Name:
Phosphatidylinositol 3-kinase regulatory subunit beta
Synonyms:
P85B_HUMAN PI3-kinase subunit p85-beta PIK3R2 PtdIns-3-kinase regulatory subunit beta | PtdIns-3-kinase regulatory subunit p85-beta
Type:
Enzyme Subunit
Mol. Mass.:
81542.75
Organism:
Homo sapiens (Human)
Description:
O00459
Residue:
728
  
Inhibitor
Name:
BDBM288911
Synonyms:
US10092563, Compound 47
Type:
Small organic molecule
Emp. Form.:
C21H21ClFN9O
Mol. Mass.:
469.903
SMILES:
Fc1ccc(Cl)c2c1nc([C@@H](Nc1ncnn3ccnc13)C1CC1)n(N1CCNCC1)c2=O
: