Target
Tyrosine-protein kinase JAK3
Ligand
BDBM191619
Substrate
Meas. Tech.
HotSpot kinase assay
IC50
>10000±n/a nM
Citation
 Honigberg, LVerner, EBuggy, JJLoury, DChen, W Inhibitors of bruton's tyrosine kinase US Patent  US9181263 Publication Date 11/10/2015 
Target
Name:
Tyrosine-protein kinase JAK3
Synonyms:
JAK-3 JAK3_HUMAN Janus kinase 3 (JAK3) L-JAK | Leukocyte janus kinase
Type:
Protein
Mol. Mass.:
125111.08
Organism:
Homo sapiens (Human)
Description:
P52333
Residue:
1124
  
Inhibitor
Name:
BDBM191619
Synonyms:
US9181263, 15 | US9278100, 15
Type:
Small organic molecule
Emp. Form.:
C26H24N6O2
Mol. Mass.:
452.5078
SMILES:
CC#CC(=O)N1CCC[C@@H]1Cn1nc(-c2ccc(Oc3ccccc3)cc2)c2c(N)ncnc12
: