Target
Transient receptor potential cation channel subfamily A member 1
Ligand
BDBM191724
Substrate
Meas. Tech.
Radiometric Calcium Assay
Temperature
298.15±n/a K
IC50
5.29±n/a nM
Comments
extracted
Citation
 Khairatkar-Joshi, NKulkarni, AMukhopadhyay, IKattige, VGBhosale, VMWale, DPThomas, AKumar, SChaudhari, SS Treatment of respiratory disorders using TRPA1 antagonists US Patent  US9186360 Publication Date 11/17/2015 
Target
Name:
Transient receptor potential cation channel subfamily A member 1
Synonyms:
ANKTM1 TRPA1 Transformation-sensitive protein p120 | Transient receptor potential cation channel subfamily A member 1 (TRPA1)
Type:
Protein
Mol. Mass.:
127514.20
Organism:
Homo sapiens (Human)
Description:
O75762
Residue:
1119
  
Inhibitor
Name:
BDBM191724
Synonyms:
US9186360, 74
Type:
Small organic molecule
Emp. Form.:
C22H18ClF3N4O5S
Mol. Mass.:
542.915
SMILES:
Cc1oc2n(C)c(=O)n(C)c(=O)c2c1CC(=O)Nc1nc(cs1)-c1ccc(OCC(F)(F)F)c(Cl)c1
: