Target
Transient receptor potential cation channel subfamily V member 3
Ligand
BDBM191724
Substrate
Meas. Tech.
Radiometric Calcium Assay
Temperature
303.15±n/a K
IC50
>10000±n/a nM
Comments
extracted
Citation
 Khairatkar-Joshi, NKulkarni, AMukhopadhyay, IKattige, VGBhosale, VMWale, DPThomas, AKumar, SChaudhari, SS Treatment of respiratory disorders using TRPA1 antagonists US Patent  US9186360 Publication Date 11/17/2015 
Target
Name:
Transient receptor potential cation channel subfamily V member 3
Synonyms:
TRPV3 Transient receptor potential cation channel subfamily V member 3 (TRPV3) | Vanilloid receptor-like 3
Type:
Enzyme
Mol. Mass.:
90635.51
Organism:
Homo sapiens (Human)
Description:
Q8NET8
Residue:
790
  
Inhibitor
Name:
BDBM191724
Synonyms:
US9186360, 74
Type:
Small organic molecule
Emp. Form.:
C22H18ClF3N4O5S
Mol. Mass.:
542.915
SMILES:
Cc1oc2n(C)c(=O)n(C)c(=O)c2c1CC(=O)Nc1nc(cs1)-c1ccc(OCC(F)(F)F)c(Cl)c1
: