Target
Transient receptor potential cation channel subfamily V member 4
Ligand
BDBM50046740
Substrate
Meas. Tech.
Radiometric Calcium Assay
Temperature
303.15±n/a K
IC50
>10000±n/a nM
Comments
extracted
Citation
 Khairatkar-Joshi, NKulkarni, AMukhopadhyay, IKattige, VGBhosale, VMWale, DPThomas, AKumar, SChaudhari, SS Treatment of respiratory disorders using TRPA1 antagonists US Patent  US9186360 Publication Date 11/17/2015 
Target
Name:
Transient receptor potential cation channel subfamily V member 4
Synonyms:
TRPV4 Transient receptor potential cation channel subfamily V member 4 (TRPV4) VROAC
Type:
Enzyme
Mol. Mass.:
98290.10
Organism:
Homo sapiens (Human)
Description:
Q9HBA0
Residue:
871
  
Inhibitor
Name:
BDBM50046740
Synonyms:
CHEMBL1939972 | US9186360, 90
Type:
Small organic molecule
Emp. Form.:
C21H20N2O3S
Mol. Mass.:
380.46
SMILES:
COCCCOc1cccc(c1)C1NC(=S)NC2=C1C(=O)c1ccccc21
: