Target
Adenosine receptor A2a
Ligand
BDBM191860
Substrate
Meas. Tech.
Luciferase Assay
pH
7.4±n/a
Temperature
310.15±n/a K
EC50
1980±n/a nM
Comments
extracted
Citation
 Vakalopoulos, AMeibom, DNell, PSussmeier, FAlbrecht-Kupper, BZimmermann, KKeldenich, JSchneider, DKrenz, U Substituted dicyanopyridines and use thereof US Patent  US9187428 Publication Date 11/17/2015 
Target
Name:
Adenosine receptor A2a
Synonyms:
A2A adenosine receptor (hA2A) ADENOSINE A2 ADORA2 Adenosine A2A receptor (A2AAR)
Type:
G Protein-Coupled Receptor (GPCR)
Mol. Mass.:
44716.46
Organism:
Homo sapiens (Human)
Description:
P29274
Residue:
412
  
Inhibitor
Name:
BDBM191860
Synonyms:
US9187428, 88
Type:
Small organic molecule
Emp. Form.:
C22H19N7O2S
Mol. Mass.:
445.497
SMILES:
CNC(=O)c1cc(CSc2nc(NCCO)c(C#N)c(-c3ccccn3)c2C#N)ccn1
: