Target
Cytochrome b
Ligand
BDBM192023
Substrate
Meas. Tech.
Cytochrome b Enzyme Assay
pH
7.4±n/a
Temperature
298.15±n/a K
IC50
>6.4e+4±n/a nM
Comments
extracted
Citation
 Vincent, BMLanglois, JBSrinivas, RLancaster, AKScherz-Shouval, RWhitesell, LTidor, BBuchwald, SLLindquist, S A Fungal-Selective Cytochrome bc1 Inhibitor Impairs Virulence and Prevents the Evolution of Drug Resistance. Cell Chem Biol 23:978-991 (2016)  
Target
Name:
Cytochrome b
Synonyms:
Type:
Protein
Mol. Mass.:
43717.83
Organism:
Candida albicans (Yeast)
Description:
Residue:
387
  
Inhibitor
Name:
BDBM192023
Synonyms:
Inz-14
Type:
Small organic molecule
Emp. Form.:
C15H13N3O2
Mol. Mass.:
267.2826
SMILES:
COC(=O)Cn1nc(-c2cccnc2)c2ccccc12
: