Target
Cathepsin L
Ligand
BDBM48184
Substrate
Meas. Tech.
Proteolytic Activity Assay
pH
5±0
Temperature
310.15±0 K
Ki
70.2±0.0 nM
Citation
 Garg, SRaghav, N 2,5-Diaryloxadiazoles and their precursors as novel inhibitors of cathepsins B, H and L. Bioorg Chem 67:64-74 (2016)  
Target
Name:
Cathepsin L
Synonyms:
Type:
Mol. Mass.:
37231.51
Organism:
Capra hircus (Goat)
Description:
Residue:
334
  
Inhibitor
Name:
BDBM48184
Synonyms:
2-(3-chlorophenyl)-5-phenyl-1,3,4-oxadiazole MLS000108072 cid_259755
Type:
Small organic molecule
Emp. Form.:
C14H9ClN2O
Mol. Mass.:
256.687
SMILES:
Clc1cccc(c1)-c1nnc(o1)-c1ccccc1
: