Target
Lysosomal Pro-X carboxypeptidase
Ligand
BDBM193262
Substrate
Meas. Tech.
Enzyme Assay
Ki
61000±n/a nM
Citation
 Shariat-Madar, ZRimoldi, JMGadepalli, RS Selective inhibitors of prolylcarboxypeptidase US Patent  US9193762 Publication Date 11/24/2015 
Target
Name:
Lysosomal Pro-X carboxypeptidase
Synonyms:
Angiotensinase C PCP PRCP Prolylcarboxypeptidase | Prolylcarboxypeptidase (PRCP)
Type:
Enzyme
Mol. Mass.:
55805.19
Organism:
Homo sapiens (Human)
Description:
P42785
Residue:
496
  
Inhibitor
Name:
BDBM193262
Synonyms:
US9193762, RS-33-6
Type:
Small organic molecule
Emp. Form.:
C34H55N3O4
Mol. Mass.:
569.8182
SMILES:
CCCCCCCCCCCCCCCCNC(=O)[C@@H]1CCCN1C(=O)[C@@H]1CCCN1C(=O)OCc1ccccc1
: