Target
Lysosomal Pro-X carboxypeptidase
Ligand
BDBM193268
Substrate
Meas. Tech.
Enzyme Assay
Ki
541500±n/a nM
Citation
 Shariat-Madar, ZRimoldi, JMGadepalli, RS Selective inhibitors of prolylcarboxypeptidase US Patent  US9193762 Publication Date 11/24/2015 
Target
Name:
Lysosomal Pro-X carboxypeptidase
Synonyms:
Angiotensinase C PCP PRCP Prolylcarboxypeptidase | Prolylcarboxypeptidase (PRCP)
Type:
Enzyme
Mol. Mass.:
55805.19
Organism:
Homo sapiens (Human)
Description:
P42785
Residue:
496
  
Inhibitor
Name:
BDBM193268
Synonyms:
US9193762, RS-33-13
Type:
Small organic molecule
Emp. Form.:
C25H27F2N3O4
Mol. Mass.:
471.4964
SMILES:
Fc1cccc(F)c1CNC(=O)[C@@H]1CCCN1C(=O)[C@@H]1CCCN1C(=O)OCc1ccccc1
: