Target
Protein O-GlcNAcase
Ligand
BDBM193650
Substrate
Meas. Tech.
Cell-based ELISA Assay
Temperature
277.15±n/a K
EC50
4.7±n/a nM
Comments
extracted
Citation
 Li, TMcEachern, EJVocadlo, DJZhou, YSelnick, HG Selective glycosidase inhibitors and uses thereof US Patent  US9199949 Publication Date 12/1/2015 
Target
Name:
Protein O-GlcNAcase
Synonyms:
2-acetamido-2-deoxy-β-D-glucopyranosidase (O-GlcNAcase) Beta-hexosaminidase (O-GlcNAcase) HEXC MEA5 N-acetyl-beta-D-glucosaminidase (O-GlcNAcase) OGA Protein O-GlcNAcase
Type:
Enzyme
Mol. Mass.:
102874.67
Organism:
Homo sapiens (Human)
Description:
O60502
Residue:
916
  
Inhibitor
Name:
BDBM193650
Synonyms:
US9199949, 8
Type:
Small organic molecule
Emp. Form.:
C9H14F2N2O3
Mol. Mass.:
236.2159
SMILES:
CNC1=N[C@H]2[C@H](C[C@H](C(F)F)[C@@H](O)[C@@H]2O)O1
: