Target
Protein O-GlcNAcase
Ligand
BDBM193649
Substrate
Meas. Tech.
Fluorescence-Based Assay
pH
7±n/a
Temperature
298.15±n/a K
Ki
0.7±n/a nM
Comments
extracted
Citation
 Li, TMcEachern, EJVocadlo, DJZhou, YSelnick, HG Selective glycosidase inhibitors and uses thereof US Patent  US9199949 Publication Date 12/1/2015 
Target
Name:
Protein O-GlcNAcase
Synonyms:
2-acetamido-2-deoxy-β-D-glucopyranosidase (O-GlcNAcase) Beta-hexosaminidase (O-GlcNAcase) HEXC MEA5 N-acetyl-beta-D-glucosaminidase (O-GlcNAcase) OGA Protein O-GlcNAcase
Type:
Enzyme
Mol. Mass.:
102874.67
Organism:
Homo sapiens (Human)
Description:
O60502
Residue:
916
  
Inhibitor
Name:
BDBM193649
Synonyms:
US9199949, 6
Type:
Small organic molecule
Emp. Form.:
C11H16F2N2O3
Mol. Mass.:
262.2531
SMILES:
O[C@@H]1[C@H]2N=C(O[C@H]2C[C@H](C(F)F)[C@H]1O)N1CCC1
: