Target
Bromodomain-containing protein 4 [44-168]
Ligand
BDBM193892
Substrate
Meas. Tech.
BRD4-BD1 Binding Assay
Temperature
298.15±n/a K
IC50
5e+2± 26 nM
Comments
extracted
Citation
 Yang, YZhao, LXu, BYang, LZhang, JZhang, HZhou, J Design, synthesis and biological evaluation of dihydroquinoxalinone derivatives as BRD4 inhibitors. Bioorg Chem 68:236-44 (2016)  
Target
Name:
Bromodomain-containing protein 4 [44-168]
Synonyms:
BET bromodomain 4(1) (BRD4(1)) BRD4-BD1 protein (aa 44-168) Bromodomain protein 4 (BRD4-BD1) Bromodomain-containing protein 4 (BRD4) (aa 44-168) Bromodomain-containing protein 4 bromodomain 1 (BRD4-BD1) | HUNK1
Type:
Enzyme Catalytic Domain
Mol. Mass.:
14866.49
Organism:
Homo sapiens (Human)
Description:
aa (44-168)
Residue:
125
  
Inhibitor
Name:
BDBM193892
Synonyms:
4-(4-Chlorobenzyl)-6-(3,5-dimethylisoxazol-4-yl)-3,4-dihydroquinoxalin-2(1H)-one (5k)
Type:
Small organic molecule
Emp. Form.:
C20H18ClN3O2
Mol. Mass.:
367.829
SMILES:
Cc1noc(C)c1-c1ccc2NC(=O)CN(Cc3ccc(Cl)cc3)c2c1
: