Target
Mast/stem cell growth factor receptor Kit
Ligand
BDBM194027
Substrate
Meas. Tech.
Cell Proliferation Assay
IC50
203±n/a nM
Citation
 Yeh, VLi, XLiu, XLoren, JMolteni, VNabakka, JNguyen, BPetrassi, HM Compounds and compositions as C-kit kinase inhibitors US Patent  US9199981 Publication Date 12/1/2015 
Target
Name:
Mast/stem cell growth factor receptor Kit
Synonyms:
CD117 antigen KIT Mast/stem cell growth factor receptor Kit (cKIT) Proto-oncogene tyrosine-protein kinase Kit Stem cell growth factor receptor Tyrosine-protein kinase Kit c-kit v-kit Hardy-Zuckerman 4 feline sarcoma viral oncogene homolog
Type:
Protein
Mol. Mass.:
109869.37
Organism:
Homo sapiens (Human)
Description:
P10721
Residue:
976
  
Inhibitor
Name:
BDBM194027
Synonyms:
US9199981, F117
Type:
Small organic molecule
Emp. Form.:
C23H22N6O3
Mol. Mass.:
430.4592
SMILES:
CO\N=C1\CCC(C1)c1nc(no1)-c1ccc(C)c(NC(=O)c2cnc3ccccn23)c1
: