Target
Hypoxanthine-guanine phosphoribosyltransferase
Ligand
BDBM194490
Substrate
Meas. Tech.
Spectrophotometric Assay
pH
7.4±n/a
Ki
1000±500 nM
Comments
extracted
Citation
 De Jersey, JGuddat, LWHockova, DKeough, DT 6-oxopurine phosphoribosyltransferase inhibitors US Patent  US9200020 Publication Date 12/1/2015 
Target
Name:
Hypoxanthine-guanine phosphoribosyltransferase
Synonyms:
HGPRT HPRT HPRT_HUMAN Hypoxanthine-guanine phosphoribosyltransferase (HGPRT)
Type:
Protein
Mol. Mass.:
24579.61
Organism:
Homo sapiens (Human)
Description:
P00492
Residue:
218
  
Inhibitor
Name:
BDBM194490
Synonyms:
US9200020, Table 1, Compound 1
Type:
Small organic molecule
Emp. Form.:
C9H15N5O5P
Mol. Mass.:
304.2197
SMILES:
Nc1nc2n(CCOCCP(O)(O)=O)c[nH]c2c(=O)[nH]1
: