Target
Hypoxanthine phosphoribosyltransferase
Ligand
BDBM194494
Substrate
Meas. Tech.
Spectrophotometric Assay
pH
7.4±n/a
Ki
>200000±n/a nM
Comments
extracted
Citation
 De Jersey, JGuddat, LWHockova, DKeough, DT 6-oxopurine phosphoribosyltransferase inhibitors US Patent  US9200020 Publication Date 12/1/2015 
Target
Name:
Hypoxanthine phosphoribosyltransferase
Synonyms:
Hypoxanthine-guanine phosphoribosyltransferase (HGPRT)
Type:
Enzyme
Mol. Mass.:
26972.31
Organism:
Plasmodium vivax
Description:
A0A0J9TE27
Residue:
233
  
Inhibitor
Name:
BDBM194494
Synonyms:
US9200020, Table 3 compound 3
Type:
Small organic molecule
Emp. Form.:
C14H24N6O6P
Mol. Mass.:
403.3507
SMILES:
COC(=O)CCCN(CCn1c[nH]c2c1nc(N)[nH]c2=O)CCP(O)(O)=O
: