Target
Hypoxanthine phosphoribosyltransferase
Ligand
BDBM194502
Substrate
Meas. Tech.
Spectrophotometric Assay
pH
7.4±n/a
Ki
900±100 nM
Comments
extracted
Citation
 De Jersey, JGuddat, LWHockova, DKeough, DT 6-oxopurine phosphoribosyltransferase inhibitors US Patent  US9200020 Publication Date 12/1/2015 
Target
Name:
Hypoxanthine phosphoribosyltransferase
Synonyms:
Hypoxanthine-guanine phosphoribosyltransferase (HGPRT)
Type:
Enzyme
Mol. Mass.:
26972.31
Organism:
Plasmodium vivax
Description:
A0A0J9TE27
Residue:
233
  
Inhibitor
Name:
BDBM194502
Synonyms:
US9200020, Table 3 compound 11
Type:
Small organic molecule
Emp. Form.:
C11H21N6O7P2
Mol. Mass.:
411.268
SMILES:
Nc1nc2n(CCN(CCP(O)(O)=O)CCP(O)(O)=O)c[nH]c2c(=O)[nH]1
: